PHPUnit 9.6.36 by Sebastian Bergmann and contributors. ............................................................. 61 / 1357 ( 4%) ....... [perf] contents=5 total=12 field=1 [perf] contents=30 total=11 field=1 ...................................................... 122 / 1357 ( 8%) .....................................F....................... 183 / 1357 ( 13%) .................E......F.................................... 244 / 1357 ( 17%) ............................................................. 305 / 1357 ( 22%) ....................................[convert_footer_menu_widget_15] converted: footer_menu #15 → menu menu_type=footer ......................... 366 / 1357 ( 26%) ...........FFF......F..........F.....FFF....FFF...FF......... 427 / 1357 ( 31%) F....F....................................................... 488 / 1357 ( 35%) .......................................................F..... 549 / 1357 ( 40%) ...........F.................FF.............F......F...F..... 610 / 1357 ( 44%) ..................................S...........S.............. 671 / 1357 ( 49%) ....................FF....................................... 732 / 1357 ( 53%) ......................F...................................... 793 / 1357 ( 58%) ............................................................. 854 / 1357 ( 62%) .......................................F..................... 915 / 1357 ( 67%) ............................................................. 976 / 1357 ( 71%) ............................................................. 1037 / 1357 ( 76%) ............................................................. 1098 / 1357 ( 80%) ....................................F........................ 1159 / 1357 ( 85%) ............................................................. 1220 / 1357 ( 89%) ............................................................. 1281 / 1357 ( 94%) ............................................................. 1342 / 1357 ( 98%) ............... 1357 / 1357 (100%) Time: 05:00.007, Memory: 438.00 MB There was 1 error: 1) Tests\Feature\BootstrapIdempotencyTest::test_menu_seeder_is_idempotent_and_preserves_admin_title Illuminate\Database\Eloquent\ModelNotFoundException: No query results for model [Modules\Menus\Models\Menu]. F:\xampp\htdocs\bigcms\vendor\laravel\framework\src\Illuminate\Database\Eloquent\Builder.php:527 F:\xampp\htdocs\bigcms\tests\Feature\BootstrapIdempotencyTest.php:111 phpvfscomposer://F:\xampp\htdocs\bigcms\vendor\phpunit\phpunit\phpunit:106 -- There were 29 failures: 1) Tests\Feature\AudioListingThemeTest::test_audio_theme_keeps_search_sort_and_pagination Failed asserting that '\r\n \r\n \r\n \r\n \r\n ادعیه و زیارات | پايگاه علمي المنجي\r\n \r\n \r\n \r\n \r\n \r\n \r\n \r\n \r\n \r\n \r\n \r\n \r\n \r\n \r\n \r\n \r\n \r\n \r\n \r\n \r\n
\r\n \r\n \r\n
\r\n \r\n
\r\n \r\n
\r\n
\r\n \r\n \r\n
\r\n

ادعیه و زیارات

\r\n

\r\n \r\n 0\r\n بازدید\r\n

\r\n
\r\n \r\n \r\n \r\n

\r\n نتایج برای «unique-audio-keyword»\r\n

\r\n \r\n
\r\n

\r\n نتیجه‌ای برای «unique-audio-keyword» پیدا نشد.\r\n

\r\n
\r\n
\r\n
\r\n
\r\n \r\n \r\n \r\n \r\n \r\n \r\n \r\n ' contains "Findable Prayer". F:\xampp\htdocs\bigcms\vendor\laravel\framework\src\Illuminate\Testing\TestResponse.php:581 F:\xampp\htdocs\bigcms\tests\Feature\AudioListingThemeTest.php:129 phpvfscomposer://F:\xampp\htdocs\bigcms\vendor\phpunit\phpunit\phpunit:106 2) Tests\Feature\CompactListingThemeTest::test_compact_keeps_search_sort_and_pagination Failed asserting that '\r\n \r\n \r\n \r\n \r\n اخبار سایت | پايگاه علمي المنجي\r\n \r\n \r\n \r\n \r\n \r\n \r\n \r\n \r\n \r\n \r\n \r\n \r\n \r\n \r\n \r\n \r\n \r\n \r\n \r\n \r\n
\r\n \r\n \r\n
\r\n \r\n
\r\n \r\n
\r\n
\r\n \r\n \r\n
\r\n

اخبار سایت

\r\n

\r\n \r\n 0\r\n بازدید\r\n

\r\n
\r\n \r\n \r\n \r\n

\r\n نتایج برای «unique-compact-keyword»\r\n

\r\n \r\n
\r\n

\r\n نتیجه‌ای برای «unique-compact-keyword» پیدا نشد.\r\n

\r\n
\r\n
\r\n
\r\n
\r\n \r\n \r\n \r\n \r\n \r\n \r\n \r\n ' contains "Findable Compact". F:\xampp\htdocs\bigcms\vendor\laravel\framework\src\Illuminate\Testing\TestResponse.php:581 F:\xampp\htdocs\bigcms\tests\Feature\CompactListingThemeTest.php:198 phpvfscomposer://F:\xampp\htdocs\bigcms\vendor\phpunit\phpunit\phpunit:106 3) Tests\Feature\EmbeddedFileDiscoveryTest::test_single_image_creates_single_value_field Failed asserting that '{"fid":1,"alt":"A"}' contains "a.jpg". F:\xampp\htdocs\bigcms\tests\Feature\EmbeddedFileDiscoveryTest.php:106 phpvfscomposer://F:\xampp\htdocs\bigcms\vendor\phpunit\phpunit\phpunit:106 4) Tests\Feature\EmbeddedFileDiscoveryTest::test_multiple_images_use_deltas_in_html_order Failed asserting that '{"fid":1,"alt":""}' contains "a.jpg". F:\xampp\htdocs\bigcms\tests\Feature\EmbeddedFileDiscoveryTest.php:130 phpvfscomposer://F:\xampp\htdocs\bigcms\vendor\phpunit\phpunit\phpunit:106 5) Tests\Feature\EmbeddedFileDiscoveryTest::test_single_pdf_creates_file_field Failed asserting that '{"fid":1,"alt":""}' contains "doc.pdf". F:\xampp\htdocs\bigcms\tests\Feature\EmbeddedFileDiscoveryTest.php:153 phpvfscomposer://F:\xampp\htdocs\bigcms\vendor\phpunit\phpunit\phpunit:106 6) Tests\Feature\EmbeddedFileDiscoveryTest::test_second_run_is_idempotent Failed asserting that 2 is identical to 0. F:\xampp\htdocs\bigcms\tests\Feature\EmbeddedFileDiscoveryTest.php:243 phpvfscomposer://F:\xampp\htdocs\bigcms\vendor\phpunit\phpunit\phpunit:106 7) Tests\Feature\EmbeddedHtmlUrlReplacementTest::test_replace_does_not_duplicate_field_values_or_cms_media Failed asserting that 2 is identical to 1. F:\xampp\htdocs\bigcms\tests\Feature\EmbeddedHtmlUrlReplacementTest.php:252 phpvfscomposer://F:\xampp\htdocs\bigcms\vendor\phpunit\phpunit\phpunit:106 8) Tests\Feature\EmbeddedLegacyFileDiscoveryTest::test_sites_default_files_image_is_copied_to_gallery Failed asserting that '{"fid":1,"alt":"A"}' contains "media/gallery/a.jpg". F:\xampp\htdocs\bigcms\tests\Feature\EmbeddedLegacyFileDiscoveryTest.php:176 phpvfscomposer://F:\xampp\htdocs\bigcms\vendor\phpunit\phpunit\phpunit:106 9) Tests\Feature\EmbeddedLegacyFileDiscoveryTest::test_pdfbook_file_is_copied_to_media_pdf Failed asserting that '{"fid":1,"alt":""}' contains "media/pdf/a.pdf". F:\xampp\htdocs\bigcms\tests\Feature\EmbeddedLegacyFileDiscoveryTest.php:196 phpvfscomposer://F:\xampp\htdocs\bigcms\vendor\phpunit\phpunit\phpunit:106 10) Tests\Feature\EmbeddedLegacyFileDiscoveryTest::test_multiple_legacy_images_use_deltas Failed asserting that '{"fid":1,"alt":""}' contains "a.jpg". F:\xampp\htdocs\bigcms\tests\Feature\EmbeddedLegacyFileDiscoveryTest.php:214 phpvfscomposer://F:\xampp\htdocs\bigcms\vendor\phpunit\phpunit\phpunit:106 11) Tests\Feature\EmbeddedLegacyFileDiscoveryTest::test_collision_same_binary_reuses_file Failed asserting that '{"fid":1,"alt":""}' contains "media/gallery/same.jpg". F:\xampp\htdocs\bigcms\tests\Feature\EmbeddedLegacyFileDiscoveryTest.php:274 phpvfscomposer://F:\xampp\htdocs\bigcms\vendor\phpunit\phpunit\phpunit:106 12) Tests\Feature\EmbeddedLegacyFileDiscoveryTest::test_collision_different_binary_gets_hash_suffix Failed asserting that '{"fid":1,"alt":""}' contains "dup-". F:\xampp\htdocs\bigcms\tests\Feature\EmbeddedLegacyFileDiscoveryTest.php:291 phpvfscomposer://F:\xampp\htdocs\bigcms\vendor\phpunit\phpunit\phpunit:106 13) Tests\Feature\EmbeddedLegacyFileDiscoveryTest::test_second_run_idempotent_no_duplicate_values_or_files Failed asserting that 1 is identical to 0. F:\xampp\htdocs\bigcms\tests\Feature\EmbeddedLegacyFileDiscoveryTest.php:306 phpvfscomposer://F:\xampp\htdocs\bigcms\vendor\phpunit\phpunit\phpunit:106 14) Tests\Feature\EmbeddedLegacyFileDiscoveryTest::test_subdirectory_storage_url_resolves_and_is_idempotent Failed asserting that 1 is identical to 0. F:\xampp\htdocs\bigcms\tests\Feature\EmbeddedLegacyFileDiscoveryTest.php:378 phpvfscomposer://F:\xampp\htdocs\bigcms\vendor\phpunit\phpunit\phpunit:106 15) Tests\Feature\ExampleTest::test_example Expected response status code [200] but received 500. The following exception occurred during the request: PDOException: SQLSTATE[HY000]: General error: 1 no such table: cms_languages in F:\xampp\htdocs\bigcms\vendor\laravel\framework\src\Illuminate\Database\Connection.php:368 Stack trace: #0 F:\xampp\htdocs\bigcms\vendor\laravel\framework\src\Illuminate\Database\Connection.php(368): PDO->prepare('select * from "...') #1 F:\xampp\htdocs\bigcms\vendor\laravel\framework\src\Illuminate\Database\Connection.php(705): Illuminate\Database\Connection->Illuminate\Database\{closure}('select * from "...', Array) #2 F:\xampp\htdocs\bigcms\vendor\laravel\framework\src\Illuminate\Database\Connection.php(672): Illuminate\Database\Connection->runQueryCallback('select * from "...', Array, Object(Closure)) #3 F:\xampp\htdocs\bigcms\vendor\laravel\framework\src\Illuminate\Database\Connection.php(376): Illuminate\Database\Connection->run('select * from "...', Array, Object(Closure)) #4 F:\xampp\htdocs\bigcms\vendor\laravel\framework\src\Illuminate\Database\Query\Builder.php(2414): Illuminate\Database\Connection->select('select * from "...', Array, true) #5 F:\xampp\htdocs\bigcms\vendor\laravel\framework\src\Illuminate\Database\Query\Builder.php(2402): Illuminate\Database\Query\Builder->runSelect() #6 F:\xampp\htdocs\bigcms\vendor\laravel\framework\src\Illuminate\Database\Query\Builder.php(2936): Illuminate\Database\Query\Builder->Illuminate\Database\Query\{closure}() #7 F:\xampp\htdocs\bigcms\vendor\laravel\framework\src\Illuminate\Database\Query\Builder.php(2403): Illuminate\Database\Query\Builder->onceWithColumns(Array, Object(Closure)) #8 F:\xampp\htdocs\bigcms\vendor\laravel\framework\src\Illuminate\Database\Eloquent\Builder.php(625): Illuminate\Database\Query\Builder->get(Array) #9 F:\xampp\htdocs\bigcms\vendor\laravel\framework\src\Illuminate\Database\Eloquent\Builder.php(609): Illuminate\Database\Eloquent\Builder->getModels(Array) #10 F:\xampp\htdocs\bigcms\vendor\laravel\framework\src\Illuminate\Database\Concerns\BuildsQueries.php(294): Illuminate\Database\Eloquent\Builder->get(Array) #11 F:\xampp\htdocs\bigcms\Modules\Languages\Services\LanguageService.php(170): Illuminate\Database\Eloquent\Builder->first() #12 F:\xampp\htdocs\bigcms\Modules\Languages\Services\LanguageService.php(198): Modules\Languages\Services\LanguageService->defaultLanguage() #13 F:\xampp\htdocs\bigcms\routes\web.php(7): Modules\Languages\Services\LanguageService->defaultCode() #14 F:\xampp\htdocs\bigcms\vendor\laravel\framework\src\Illuminate\Routing\Route.php(238): Illuminate\Routing\RouteFileRegistrar->{closure}(Object(Modules\Languages\Services\LanguageService)) #15 F:\xampp\htdocs\bigcms\vendor\laravel\framework\src\Illuminate\Routing\Route.php(208): Illuminate\Routing\Route->runCallable() #16 F:\xampp\htdocs\bigcms\vendor\laravel\framework\src\Illuminate\Routing\Router.php(721): Illuminate\Routing\Route->run() #17 F:\xampp\htdocs\bigcms\vendor\laravel\framework\src\Illuminate\Pipeline\Pipeline.php(128): Illuminate\Routing\Router->Illuminate\Routing\{closure}(Object(Illuminate\Http\Request)) #18 F:\xampp\htdocs\bigcms\vendor\laravel\framework\src\Illuminate\Routing\Middleware\SubstituteBindings.php(50): Illuminate\Pipeline\Pipeline->Illuminate\Pipeline\{closure}(Object(Illuminate\Http\Request)) #19 F:\xampp\htdocs\bigcms\vendor\laravel\framework\src\Illuminate\Pipeline\Pipeline.php(167): Illuminate\Routing\Middleware\SubstituteBindings->handle(Object(Illuminate\Http\Request), Object(Closure)) #20 F:\xampp\htdocs\bigcms\vendor\laravel\framework\src\Illuminate\Foundation\Http\Middleware\VerifyCsrfToken.php(78): Illuminate\Pipeline\Pipeline->Illuminate\Pipeline\{closure}(Object(Illuminate\Http\Request)) #21 F:\xampp\htdocs\bigcms\vendor\laravel\framework\src\Illuminate\Pipeline\Pipeline.php(167): Illuminate\Foundation\Http\Middleware\VerifyCsrfToken->handle(Object(Illuminate\Http\Request), Object(Closure)) #22 F:\xampp\htdocs\bigcms\vendor\laravel\framework\src\Illuminate\View\Middleware\ShareErrorsFromSession.php(49): Illuminate\Pipeline\Pipeline->Illuminate\Pipeline\{closure}(Object(Illuminate\Http\Request)) #23 F:\xampp\htdocs\bigcms\vendor\laravel\framework\src\Illuminate\Pipeline\Pipeline.php(167): Illuminate\View\Middleware\ShareErrorsFromSession->handle(Object(Illuminate\Http\Request), Object(Closure)) #24 F:\xampp\htdocs\bigcms\vendor\laravel\framework\src\Illuminate\Session\Middleware\StartSession.php(121): Illuminate\Pipeline\Pipeline->Illuminate\Pipeline\{closure}(Object(Illuminate\Http\Request)) #25 F:\xampp\htdocs\bigcms\vendor\laravel\framework\src\Illuminate\Session\Middleware\StartSession.php(64): Illuminate\Session\Middleware\StartSession->handleStatefulRequest(Object(Illuminate\Http\Request), Object(Illuminate\Session\Store), Object(Closure)) #26 F:\xampp\htdocs\bigcms\vendor\laravel\framework\src\Illuminate\Pipeline\Pipeline.php(167): Illuminate\Session\Middleware\StartSession->handle(Object(Illuminate\Http\Request), Object(Closure)) #27 F:\xampp\htdocs\bigcms\vendor\laravel\framework\src\Illuminate\Cookie\Middleware\AddQueuedCookiesToResponse.php(37): Illuminate\Pipeline\Pipeline->Illuminate\Pipeline\{closure}(Object(Illuminate\Http\Request)) #28 F:\xampp\htdocs\bigcms\vendor\laravel\framework\src\Illuminate\Pipeline\Pipeline.php(167): Illuminate\Cookie\Middleware\AddQueuedCookiesToResponse->handle(Object(Illuminate\Http\Request), Object(Closure)) #29 F:\xampp\htdocs\bigcms\vendor\laravel\framework\src\Illuminate\Cookie\Middleware\EncryptCookies.php(67): Illuminate\Pipeline\Pipeline->Illuminate\Pipeline\{closure}(Object(Illuminate\Http\Request)) #30 F:\xampp\htdocs\bigcms\vendor\laravel\framework\src\Illuminate\Pipeline\Pipeline.php(167): Illuminate\Cookie\Middleware\EncryptCookies->handle(Object(Illuminate\Http\Request), Object(Closure)) #31 F:\xampp\htdocs\bigcms\vendor\laravel\framework\src\Illuminate\Pipeline\Pipeline.php(103): Illuminate\Pipeline\Pipeline->Illuminate\Pipeline\{closure}(Object(Illuminate\Http\Request)) #32 F:\xampp\htdocs\bigcms\vendor\laravel\framework\src\Illuminate\Routing\Router.php(723): Illuminate\Pipeline\Pipeline->then(Object(Closure)) #33 F:\xampp\htdocs\bigcms\vendor\laravel\framework\src\Illuminate\Routing\Router.php(698): Illuminate\Routing\Router->runRouteWithinStack(Object(Illuminate\Routing\Route), Object(Illuminate\Http\Request)) #34 F:\xampp\htdocs\bigcms\vendor\laravel\framework\src\Illuminate\Routing\Router.php(662): Illuminate\Routing\Router->runRoute(Object(Illuminate\Http\Request), Object(Illuminate\Routing\Route)) #35 F:\xampp\htdocs\bigcms\vendor\laravel\framework\src\Illuminate\Routing\Router.php(651): Illuminate\Routing\Router->dispatchToRoute(Object(Illuminate\Http\Request)) #36 F:\xampp\htdocs\bigcms\vendor\laravel\framework\src\Illuminate\Foundation\Http\Kernel.php(167): Illuminate\Routing\Router->dispatch(Object(Illuminate\Http\Request)) #37 F:\xampp\htdocs\bigcms\vendor\laravel\framework\src\Illuminate\Pipeline\Pipeline.php(128): Illuminate\Foundation\Http\Kernel->Illuminate\Foundation\Http\{closure}(Object(Illuminate\Http\Request)) #38 F:\xampp\htdocs\bigcms\vendor\laravel\framework\src\Illuminate\Foundation\Http\Middleware\TransformsRequest.php(21): Illuminate\Pipeline\Pipeline->Illuminate\Pipeline\{closure}(Object(Illuminate\Http\Request)) #39 F:\xampp\htdocs\bigcms\vendor\laravel\framework\src\Illuminate\Foundation\Http\Middleware\ConvertEmptyStringsToNull.php(31): Illuminate\Foundation\Http\Middleware\TransformsRequest->handle(Object(Illuminate\Http\Request), Object(Closure)) #40 F:\xampp\htdocs\bigcms\vendor\laravel\framework\src\Illuminate\Pipeline\Pipeline.php(167): Illuminate\Foundation\Http\Middleware\ConvertEmptyStringsToNull->handle(Object(Illuminate\Http\Request), Object(Closure)) #41 F:\xampp\htdocs\bigcms\vendor\laravel\framework\src\Illuminate\Foundation\Http\Middleware\TransformsRequest.php(21): Illuminate\Pipeline\Pipeline->Illuminate\Pipeline\{closure}(Object(Illuminate\Http\Request)) #42 F:\xampp\htdocs\bigcms\vendor\laravel\framework\src\Illuminate\Foundation\Http\Middleware\TrimStrings.php(40): Illuminate\Foundation\Http\Middleware\TransformsRequest->handle(Object(Illuminate\Http\Request), Object(Closure)) #43 F:\xampp\htdocs\bigcms\vendor\laravel\framework\src\Illuminate\Pipeline\Pipeline.php(167): Illuminate\Foundation\Http\Middleware\TrimStrings->handle(Object(Illuminate\Http\Request), Object(Closure)) #44 F:\xampp\htdocs\bigcms\vendor\laravel\framework\src\Illuminate\Foundation\Http\Middleware\ValidatePostSize.php(27): Illuminate\Pipeline\Pipeline->Illuminate\Pipeline\{closure}(Object(Illuminate\Http\Request)) #45 F:\xampp\htdocs\bigcms\vendor\laravel\framework\src\Illuminate\Pipeline\Pipeline.php(167): Illuminate\Foundation\Http\Middleware\ValidatePostSize->handle(Object(Illuminate\Http\Request), Object(Closure)) #46 F:\xampp\htdocs\bigcms\vendor\laravel\framework\src\Illuminate\Foundation\Http\Middleware\PreventRequestsDuringMaintenance.php(86): Illuminate\Pipeline\Pipeline->Illuminate\Pipeline\{closure}(Object(Illuminate\Http\Request)) #47 F:\xampp\htdocs\bigcms\vendor\laravel\framework\src\Illuminate\Pipeline\Pipeline.php(167): Illuminate\Foundation\Http\Middleware\PreventRequestsDuringMaintenance->handle(Object(Illuminate\Http\Request), Object(Closure)) #48 F:\xampp\htdocs\bigcms\vendor\fruitcake\laravel-cors\src\HandleCors.php(38): Illuminate\Pipeline\Pipeline->Illuminate\Pipeline\{closure}(Object(Illuminate\Http\Request)) #49 F:\xampp\htdocs\bigcms\vendor\laravel\framework\src\Illuminate\Pipeline\Pipeline.php(167): Fruitcake\Cors\HandleCors->handle(Object(Illuminate\Http\Request), Object(Closure)) #50 F:\xampp\htdocs\bigcms\vendor\laravel\framework\src\Illuminate\Http\Middleware\TrustProxies.php(39): Illuminate\Pipeline\Pipeline->Illuminate\Pipeline\{closure}(Object(Illuminate\Http\Request)) #51 F:\xampp\htdocs\bigcms\vendor\laravel\framework\src\Illuminate\Pipeline\Pipeline.php(167): Illuminate\Http\Middleware\TrustProxies->handle(Object(Illuminate\Http\Request), Object(Closure)) #52 F:\xampp\htdocs\bigcms\vendor\laravel\framework\src\Illuminate\Pipeline\Pipeline.php(103): Illuminate\Pipeline\Pipeline->Illuminate\Pipeline\{closure}(Object(Illuminate\Http\Request)) #53 F:\xampp\htdocs\bigcms\vendor\laravel\framework\src\Illuminate\Foundation\Http\Kernel.php(142): Illuminate\Pipeline\Pipeline->then(Object(Closure)) #54 F:\xampp\htdocs\bigcms\vendor\laravel\framework\src\Illuminate\Foundation\Http\Kernel.php(111): Illuminate\Foundation\Http\Kernel->sendRequestThroughRouter(Object(Illuminate\Http\Request)) #55 F:\xampp\htdocs\bigcms\vendor\laravel\framework\src\Illuminate\Foundation\Testing\Concerns\MakesHttpRequests.php(510): Illuminate\Foundation\Http\Kernel->handle(Object(Illuminate\Http\Request)) #56 F:\xampp\htdocs\bigcms\vendor\laravel\framework\src\Illuminate\Foundation\Testing\Concerns\MakesHttpRequests.php(294): Illuminate\Foundation\Testing\TestCase->call('GET', '/', Array, Array, Array, Array) #57 F:\xampp\htdocs\bigcms\tests\Feature\ExampleTest.php(17): Illuminate\Foundation\Testing\TestCase->get('/') #58 F:\xampp\htdocs\bigcms\vendor\phpunit\phpunit\src\Framework\TestCase.php(1617): Tests\Feature\ExampleTest->test_example() #59 F:\xampp\htdocs\bigcms\vendor\phpunit\phpunit\src\Framework\TestCase.php(1223): PHPUnit\Framework\TestCase->runTest() #60 F:\xampp\htdocs\bigcms\vendor\phpunit\phpunit\src\Framework\TestResult.php(729): PHPUnit\Framework\TestCase->runBare() #61 F:\xampp\htdocs\bigcms\vendor\phpunit\phpunit\src\Framework\TestCase.php(973): PHPUnit\Framework\TestResult->run(Object(Tests\Feature\ExampleTest)) #62 F:\xampp\htdocs\bigcms\vendor\phpunit\phpunit\src\Framework\TestSuite.php(685): PHPUnit\Framework\TestCase->run(Object(PHPUnit\Framework\TestResult)) #63 F:\xampp\htdocs\bigcms\vendor\phpunit\phpunit\src\Framework\TestSuite.php(685): PHPUnit\Framework\TestSuite->run(Object(PHPUnit\Framework\TestResult)) #64 F:\xampp\htdocs\bigcms\vendor\phpunit\phpunit\src\Framework\TestSuite.php(685): PHPUnit\Framework\TestSuite->run(Object(PHPUnit\Framework\TestResult)) #65 F:\xampp\htdocs\bigcms\vendor\phpunit\phpunit\src\TextUI\TestRunner.php(651): PHPUnit\Framework\TestSuite->run(Object(PHPUnit\Framework\TestResult)) #66 F:\xampp\htdocs\bigcms\vendor\phpunit\phpunit\src\TextUI\Command.php(146): PHPUnit\TextUI\TestRunner->run(Object(PHPUnit\Framework\TestSuite), Array, Array, true) #67 F:\xampp\htdocs\bigcms\vendor\phpunit\phpunit\src\TextUI\Command.php(99): PHPUnit\TextUI\Command->run(Array, true) #68 phpvfscomposer://F:\xampp\htdocs\bigcms\vendor\phpunit\phpunit\phpunit(106): PHPUnit\TextUI\Command::main() #69 F:\xampp\htdocs\bigcms\vendor\bin\phpunit(115): include('phpvfscomposer:...') #70 {main} Next Illuminate\Database\QueryException: SQLSTATE[HY000]: General error: 1 no such table: cms_languages (SQL: select * from "cms_languages" where "is_default" = 1 and "is_active" = 1 limit 1) in F:\xampp\htdocs\bigcms\vendor\laravel\framework\src\Illuminate\Database\Connection.php:712 Stack trace: #0 F:\xampp\htdocs\bigcms\vendor\laravel\framework\src\Illuminate\Database\Connection.php(672): Illuminate\Database\Connection->runQueryCallback('select * from "...', Array, Object(Closure)) #1 F:\xampp\htdocs\bigcms\vendor\laravel\framework\src\Illuminate\Database\Connection.php(376): Illuminate\Database\Connection->run('select * from "...', Array, Object(Closure)) #2 F:\xampp\htdocs\bigcms\vendor\laravel\framework\src\Illuminate\Database\Query\Builder.php(2414): Illuminate\Database\Connection->select('select * from "...', Array, true) #3 F:\xampp\htdocs\bigcms\vendor\laravel\framework\src\Illuminate\Database\Query\Builder.php(2402): Illuminate\Database\Query\Builder->runSelect() #4 F:\xampp\htdocs\bigcms\vendor\laravel\framework\src\Illuminate\Database\Query\Builder.php(2936): Illuminate\Database\Query\Builder->Illuminate\Database\Query\{closure}() #5 F:\xampp\htdocs\bigcms\vendor\laravel\framework\src\Illuminate\Database\Query\Builder.php(2403): Illuminate\Database\Query\Builder->onceWithColumns(Array, Object(Closure)) #6 F:\xampp\htdocs\bigcms\vendor\laravel\framework\src\Illuminate\Database\Eloquent\Builder.php(625): Illuminate\Database\Query\Builder->get(Array) #7 F:\xampp\htdocs\bigcms\vendor\laravel\framework\src\Illuminate\Database\Eloquent\Builder.php(609): Illuminate\Database\Eloquent\Builder->getModels(Array) #8 F:\xampp\htdocs\bigcms\vendor\laravel\framework\src\Illuminate\Database\Concerns\BuildsQueries.php(294): Illuminate\Database\Eloquent\Builder->get(Array) #9 F:\xampp\htdocs\bigcms\Modules\Languages\Services\LanguageService.php(170): Illuminate\Database\Eloquent\Builder->first() #10 F:\xampp\htdocs\bigcms\Modules\Languages\Services\LanguageService.php(198): Modules\Languages\Services\LanguageService->defaultLanguage() #11 F:\xampp\htdocs\bigcms\routes\web.php(7): Modules\Languages\Services\LanguageService->defaultCode() #12 F:\xampp\htdocs\bigcms\vendor\laravel\framework\src\Illuminate\Routing\Route.php(238): Illuminate\Routing\RouteFileRegistrar->{closure}(Object(Modules\Languages\Services\LanguageService)) #13 F:\xampp\htdocs\bigcms\vendor\laravel\framework\src\Illuminate\Routing\Route.php(208): Illuminate\Routing\Route->runCallable() #14 F:\xampp\htdocs\bigcms\vendor\laravel\framework\src\Illuminate\Routing\Router.php(721): Illuminate\Routing\Route->run() #15 F:\xampp\htdocs\bigcms\vendor\laravel\framework\src\Illuminate\Pipeline\Pipeline.php(128): Illuminate\Routing\Router->Illuminate\Routing\{closure}(Object(Illuminate\Http\Request)) #16 F:\xampp\htdocs\bigcms\vendor\laravel\framework\src\Illuminate\Routing\Middleware\SubstituteBindings.php(50): Illuminate\Pipeline\Pipeline->Illuminate\Pipeline\{closure}(Object(Illuminate\Http\Request)) #17 F:\xampp\htdocs\bigcms\vendor\laravel\framework\src\Illuminate\Pipeline\Pipeline.php(167): Illuminate\Routing\Middleware\SubstituteBindings->handle(Object(Illuminate\Http\Request), Object(Closure)) #18 F:\xampp\htdocs\bigcms\vendor\laravel\framework\src\Illuminate\Foundation\Http\Middleware\VerifyCsrfToken.php(78): Illuminate\Pipeline\Pipeline->Illuminate\Pipeline\{closure}(Object(Illuminate\Http\Request)) #19 F:\xampp\htdocs\bigcms\vendor\laravel\framework\src\Illuminate\Pipeline\Pipeline.php(167): Illuminate\Foundation\Http\Middleware\VerifyCsrfToken->handle(Object(Illuminate\Http\Request), Object(Closure)) #20 F:\xampp\htdocs\bigcms\vendor\laravel\framework\src\Illuminate\View\Middleware\ShareErrorsFromSession.php(49): Illuminate\Pipeline\Pipeline->Illuminate\Pipeline\{closure}(Object(Illuminate\Http\Request)) #21 F:\xampp\htdocs\bigcms\vendor\laravel\framework\src\Illuminate\Pipeline\Pipeline.php(167): Illuminate\View\Middleware\ShareErrorsFromSession->handle(Object(Illuminate\Http\Request), Object(Closure)) #22 F:\xampp\htdocs\bigcms\vendor\laravel\framework\src\Illuminate\Session\Middleware\StartSession.php(121): Illuminate\Pipeline\Pipeline->Illuminate\Pipeline\{closure}(Object(Illuminate\Http\Request)) #23 F:\xampp\htdocs\bigcms\vendor\laravel\framework\src\Illuminate\Session\Middleware\StartSession.php(64): Illuminate\Session\Middleware\StartSession->handleStatefulRequest(Object(Illuminate\Http\Request), Object(Illuminate\Session\Store), Object(Closure)) #24 F:\xampp\htdocs\bigcms\vendor\laravel\framework\src\Illuminate\Pipeline\Pipeline.php(167): Illuminate\Session\Middleware\StartSession->handle(Object(Illuminate\Http\Request), Object(Closure)) #25 F:\xampp\htdocs\bigcms\vendor\laravel\framework\src\Illuminate\Cookie\Middleware\AddQueuedCookiesToResponse.php(37): Illuminate\Pipeline\Pipeline->Illuminate\Pipeline\{closure}(Object(Illuminate\Http\Request)) #26 F:\xampp\htdocs\bigcms\vendor\laravel\framework\src\Illuminate\Pipeline\Pipeline.php(167): Illuminate\Cookie\Middleware\AddQueuedCookiesToResponse->handle(Object(Illuminate\Http\Request), Object(Closure)) #27 F:\xampp\htdocs\bigcms\vendor\laravel\framework\src\Illuminate\Cookie\Middleware\EncryptCookies.php(67): Illuminate\Pipeline\Pipeline->Illuminate\Pipeline\{closure}(Object(Illuminate\Http\Request)) #28 F:\xampp\htdocs\bigcms\vendor\laravel\framework\src\Illuminate\Pipeline\Pipeline.php(167): Illuminate\Cookie\Middleware\EncryptCookies->handle(Object(Illuminate\Http\Request), Object(Closure)) #29 F:\xampp\htdocs\bigcms\vendor\laravel\framework\src\Illuminate\Pipeline\Pipeline.php(103): Illuminate\Pipeline\Pipeline->Illuminate\Pipeline\{closure}(Object(Illuminate\Http\Request)) #30 F:\xampp\htdocs\bigcms\vendor\laravel\framework\src\Illuminate\Routing\Router.php(723): Illuminate\Pipeline\Pipeline->then(Object(Closure)) #31 F:\xampp\htdocs\bigcms\vendor\laravel\framework\src\Illuminate\Routing\Router.php(698): Illuminate\Routing\Router->runRouteWithinStack(Object(Illuminate\Routing\Route), Object(Illuminate\Http\Request)) #32 F:\xampp\htdocs\bigcms\vendor\laravel\framework\src\Illuminate\Routing\Router.php(662): Illuminate\Routing\Router->runRoute(Object(Illuminate\Http\Request), Object(Illuminate\Routing\Route)) #33 F:\xampp\htdocs\bigcms\vendor\laravel\framework\src\Illuminate\Routing\Router.php(651): Illuminate\Routing\Router->dispatchToRoute(Object(Illuminate\Http\Request)) #34 F:\xampp\htdocs\bigcms\vendor\laravel\framework\src\Illuminate\Foundation\Http\Kernel.php(167): Illuminate\Routing\Router->dispatch(Object(Illuminate\Http\Request)) #35 F:\xampp\htdocs\bigcms\vendor\laravel\framework\src\Illuminate\Pipeline\Pipeline.php(128): Illuminate\Foundation\Http\Kernel->Illuminate\Foundation\Http\{closure}(Object(Illuminate\Http\Request)) #36 F:\xampp\htdocs\bigcms\vendor\laravel\framework\src\Illuminate\Foundation\Http\Middleware\TransformsRequest.php(21): Illuminate\Pipeline\Pipeline->Illuminate\Pipeline\{closure}(Object(Illuminate\Http\Request)) #37 F:\xampp\htdocs\bigcms\vendor\laravel\framework\src\Illuminate\Foundation\Http\Middleware\ConvertEmptyStringsToNull.php(31): Illuminate\Foundation\Http\Middleware\TransformsRequest->handle(Object(Illuminate\Http\Request), Object(Closure)) #38 F:\xampp\htdocs\bigcms\vendor\laravel\framework\src\Illuminate\Pipeline\Pipeline.php(167): Illuminate\Foundation\Http\Middleware\ConvertEmptyStringsToNull->handle(Object(Illuminate\Http\Request), Object(Closure)) #39 F:\xampp\htdocs\bigcms\vendor\laravel\framework\src\Illuminate\Foundation\Http\Middleware\TransformsRequest.php(21): Illuminate\Pipeline\Pipeline->Illuminate\Pipeline\{closure}(Object(Illuminate\Http\Request)) #40 F:\xampp\htdocs\bigcms\vendor\laravel\framework\src\Illuminate\Foundation\Http\Middleware\TrimStrings.php(40): Illuminate\Foundation\Http\Middleware\TransformsRequest->handle(Object(Illuminate\Http\Request), Object(Closure)) #41 F:\xampp\htdocs\bigcms\vendor\laravel\framework\src\Illuminate\Pipeline\Pipeline.php(167): Illuminate\Foundation\Http\Middleware\TrimStrings->handle(Object(Illuminate\Http\Request), Object(Closure)) #42 F:\xampp\htdocs\bigcms\vendor\laravel\framework\src\Illuminate\Foundation\Http\Middleware\ValidatePostSize.php(27): Illuminate\Pipeline\Pipeline->Illuminate\Pipeline\{closure}(Object(Illuminate\Http\Request)) #43 F:\xampp\htdocs\bigcms\vendor\laravel\framework\src\Illuminate\Pipeline\Pipeline.php(167): Illuminate\Foundation\Http\Middleware\ValidatePostSize->handle(Object(Illuminate\Http\Request), Object(Closure)) #44 F:\xampp\htdocs\bigcms\vendor\laravel\framework\src\Illuminate\Foundation\Http\Middleware\PreventRequestsDuringMaintenance.php(86): Illuminate\Pipeline\Pipeline->Illuminate\Pipeline\{closure}(Object(Illuminate\Http\Request)) #45 F:\xampp\htdocs\bigcms\vendor\laravel\framework\src\Illuminate\Pipeline\Pipeline.php(167): Illuminate\Foundation\Http\Middleware\PreventRequestsDuringMaintenance->handle(Object(Illuminate\Http\Request), Object(Closure)) #46 F:\xampp\htdocs\bigcms\vendor\fruitcake\laravel-cors\src\HandleCors.php(38): Illuminate\Pipeline\Pipeline->Illuminate\Pipeline\{closure}(Object(Illuminate\Http\Request)) #47 F:\xampp\htdocs\bigcms\vendor\laravel\framework\src\Illuminate\Pipeline\Pipeline.php(167): Fruitcake\Cors\HandleCors->handle(Object(Illuminate\Http\Request), Object(Closure)) #48 F:\xampp\htdocs\bigcms\vendor\laravel\framework\src\Illuminate\Http\Middleware\TrustProxies.php(39): Illuminate\Pipeline\Pipeline->Illuminate\Pipeline\{closure}(Object(Illuminate\Http\Request)) #49 F:\xampp\htdocs\bigcms\vendor\laravel\framework\src\Illuminate\Pipeline\Pipeline.php(167): Illuminate\Http\Middleware\TrustProxies->handle(Object(Illuminate\Http\Request), Object(Closure)) #50 F:\xampp\htdocs\bigcms\vendor\laravel\framework\src\Illuminate\Pipeline\Pipeline.php(103): Illuminate\Pipeline\Pipeline->Illuminate\Pipeline\{closure}(Object(Illuminate\Http\Request)) #51 F:\xampp\htdocs\bigcms\vendor\laravel\framework\src\Illuminate\Foundation\Http\Kernel.php(142): Illuminate\Pipeline\Pipeline->then(Object(Closure)) #52 F:\xampp\htdocs\bigcms\vendor\laravel\framework\src\Illuminate\Foundation\Http\Kernel.php(111): Illuminate\Foundation\Http\Kernel->sendRequestThroughRouter(Object(Illuminate\Http\Request)) #53 F:\xampp\htdocs\bigcms\vendor\laravel\framework\src\Illuminate\Foundation\Testing\Concerns\MakesHttpRequests.php(510): Illuminate\Foundation\Http\Kernel->handle(Object(Illuminate\Http\Request)) #54 F:\xampp\htdocs\bigcms\vendor\laravel\framework\src\Illuminate\Foundation\Testing\Concerns\MakesHttpRequests.php(294): Illuminate\Foundation\Testing\TestCase->call('GET', '/', Array, Array, Array, Array) #55 F:\xampp\htdocs\bigcms\tests\Feature\ExampleTest.php(17): Illuminate\Foundation\Testing\TestCase->get('/') #56 F:\xampp\htdocs\bigcms\vendor\phpunit\phpunit\src\Framework\TestCase.php(1617): Tests\Feature\ExampleTest->test_example() #57 F:\xampp\htdocs\bigcms\vendor\phpunit\phpunit\src\Framework\TestCase.php(1223): PHPUnit\Framework\TestCase->runTest() #58 F:\xampp\htdocs\bigcms\vendor\phpunit\phpunit\src\Framework\TestResult.php(729): PHPUnit\Framework\TestCase->runBare() #59 F:\xampp\htdocs\bigcms\vendor\phpunit\phpunit\src\Framework\TestCase.php(973): PHPUnit\Framework\TestResult->run(Object(Tests\Feature\ExampleTest)) #60 F:\xampp\htdocs\bigcms\vendor\phpunit\phpunit\src\Framework\TestSuite.php(685): PHPUnit\Framework\TestCase->run(Object(PHPUnit\Framework\TestResult)) #61 F:\xampp\htdocs\bigcms\vendor\phpunit\phpunit\src\Framework\TestSuite.php(685): PHPUnit\Framework\TestSuite->run(Object(PHPUnit\Framework\TestResult)) #62 F:\xampp\htdocs\bigcms\vendor\phpunit\phpunit\src\Framework\TestSuite.php(685): PHPUnit\Framework\TestSuite->run(Object(PHPUnit\Framework\TestResult)) #63 F:\xampp\htdocs\bigcms\vendor\phpunit\phpunit\src\TextUI\TestRunner.php(651): PHPUnit\Framework\TestSuite->run(Object(PHPUnit\Framework\TestResult)) #64 F:\xampp\htdocs\bigcms\vendor\phpunit\phpunit\src\TextUI\Command.php(146): PHPUnit\TextUI\TestRunner->run(Object(PHPUnit\Framework\TestSuite), Array, Array, true) #65 F:\xampp\htdocs\bigcms\vendor\phpunit\phpunit\src\TextUI\Command.php(99): PHPUnit\TextUI\Command->run(Array, true) #66 phpvfscomposer://F:\xampp\htdocs\bigcms\vendor\phpunit\phpunit\phpunit(106): PHPUnit\TextUI\Command::main() #67 F:\xampp\htdocs\bigcms\vendor\bin\phpunit(115): include('phpvfscomposer:...') #68 {main} Failed asserting that 200 is identical to 500. F:\xampp\htdocs\bigcms\vendor\laravel\framework\src\Illuminate\Testing\TestResponse.php:177 F:\xampp\htdocs\bigcms\tests\Feature\ExampleTest.php:19 phpvfscomposer://F:\xampp\htdocs\bigcms\vendor\phpunit\phpunit\phpunit:106 16) Tests\Feature\FieldManagementTest::test_new_field_appears_on_content_create_form Failed asserting that '\n \n \n \n \n \n افزودن محتوا — پنل مدیریت\n \n \n \n \n \n \n \n \n \n
\n \n
\n
\n
\n \n

افزودن محتوا

\n
\n \n
\n
--:--:--
\n
\n جلالی: ...\n میلادی: ...\n هجری: ...\n
\n
\n \n
\n \n مشاهده سایت\n \n
\n \n
\n \n
\n
\n
\n
\n

افزودن محتوا

\n بازگشت\n
\n
\n
\n

نوع محتوا

\n
\n \n
\n
\n \n
\n \n \n
\n \n
\n \n \n
\n \n
\n
\n
\n
\n
\n
\n

محتوا

\n
\n
\n \n \n \n \r\n \r\n
\n
\n
\n
\n

سایر

\n
\n
\n \n \n \n \r\n
\n
\n \n \n \n \r\n
\n
\n \n \n \n \r\n \r\n
\n
\n \n \n \n \r\n
\n
\n \n \n \n \r\n \r\n
\n
\n
\n
\n
\n
\n

تصویر شاخص

\n
\n
\n \n \n \n \r\n
\r\n \r\n
\r\n \r\n \r\n
\r\n
\r\n
\r\n \r\n \r\n
\r\n \r\n
\n
\n
\n
\n

رسانه

\n
\n
\n \n \n \n
\r\n \r\n \r\n
\r\n \r\n
\n
\n
\n
\n
\n
\n
\n \n
\n
\n

انتشار

\n
\n
\n \n \n
\n
\n \n \n
\n
\n \n \n \n
\n
\n
\n \n
\n

زبان

\n
\n \n
\n
\n \n
\n

تاریخ انتشار

\n
\n \n
\n
\n \n \n \n
\n
\n
\n \n \n \n
\n
\n
\n
\n \n
\n
\n
منو
\n \n
\n
\n
\n
\n
\n \n
\n

پنل مدیریت

\n
Almonji CMS
\n
\n \n \n
\n
\n
\n \n \n \n \n \n \n \n \n \n \n ' contains "زیرعنوان". F:\xampp\htdocs\bigcms\vendor\laravel\framework\src\Illuminate\Testing\TestResponse.php:581 F:\xampp\htdocs\bigcms\tests\Feature\FieldManagementTest.php:229 phpvfscomposer://F:\xampp\htdocs\bigcms\vendor\phpunit\phpunit\phpunit:106 17) Tests\Feature\FieldManagementTest::test_inactive_field_is_hidden_from_content_form Failed asserting that '\n \n \n \n \n \n افزودن محتوا — پنل مدیریت\n \n \n \n \n \n \n \n \n \n
\n \n
\n
\n
\n \n

افزودن محتوا

\n
\n \n
\n
--:--:--
\n
\n جلالی: ...\n میلادی: ...\n هجری: ...\n
\n
\n \n
\n \n مشاهده سایت\n \n
\n \n
\n \n
\n
\n
\n
\n

افزودن محتوا

\n بازگشت\n
\n
\n
\n

نوع محتوا

\n
\n \n
\n
\n \n
\n \n \n
\n \n
\n \n \n
\n \n
\n
\n
\n
\n
\n
\n

محتوا

\n
\n
\n \n \n \n \r\n \r\n
\n
\n
\n
\n

سایر

\n
\n
\n \n \n \n \r\n
\n
\n \n \n \n \r\n
\n
\n \n \n \n \r\n \r\n
\n
\n \n \n \n \r\n
\n
\n \n \n \n \r\n \r\n
\n
\n
\n
\n
\n
\n

تصویر شاخص

\n
\n
\n \n \n \n \r\n
\r\n \r\n
\r\n \r\n \r\n
\r\n
\r\n
\r\n \r\n \r\n
\r\n \r\n
\n
\n
\n
\n

رسانه

\n
\n
\n \n \n \n
\r\n \r\n \r\n
\r\n \r\n
\n
\n
\n
\n
\n
\n
\n \n
\n
\n

انتشار

\n
\n
\n \n \n
\n
\n \n \n
\n
\n \n \n \n
\n
\n
\n \n
\n

زبان

\n
\n \n
\n
\n \n
\n

تاریخ انتشار

\n
\n \n
\n
\n \n \n \n
\n
\n
\n \n \n \n
\n
\n
\n
\n \n
\n
\n
منو
\n \n
\n
\n
\n
\n
\n \n
\n

پنل مدیریت

\n
Almonji CMS
\n
\n \n \n
\n
\n
\n \n \n \n \n \n \n \n \n \n \n ' contains "temp_banner". F:\xampp\htdocs\bigcms\vendor\laravel\framework\src\Illuminate\Testing\TestResponse.php:581 F:\xampp\htdocs\bigcms\tests\Feature\FieldManagementTest.php:345 phpvfscomposer://F:\xampp\htdocs\bigcms\vendor\phpunit\phpunit\phpunit:106 18) Tests\Feature\FrontendContentListTest::test_list_does_not_cause_n_plus_one Failed asserting that 27 is equal to 25 or is less than 25. F:\xampp\htdocs\bigcms\tests\Feature\FrontendContentListTest.php:231 phpvfscomposer://F:\xampp\htdocs\bigcms\vendor\phpunit\phpunit\phpunit:106 19) Tests\Feature\FrontendContentSearchTest::test_search_results_do_not_cause_n_plus_one Failed asserting that 27 is equal to 25 or is less than 25. F:\xampp\htdocs\bigcms\tests\Feature\FrontendContentSearchTest.php:218 phpvfscomposer://F:\xampp\htdocs\bigcms\vendor\phpunit\phpunit\phpunit:106 20) Tests\Feature\FrontendContentSeoTest::test_detail_seo_query_count_stays_bounded Failed asserting that 27 is equal to 25 or is less than 25. F:\xampp\htdocs\bigcms\tests\Feature\FrontendContentSeoTest.php:305 phpvfscomposer://F:\xampp\htdocs\bigcms\vendor\phpunit\phpunit\phpunit:106 21) Tests\Feature\FrontendContentSeoTest::test_listing_seo_does_not_cause_n_plus_one Failed asserting that 27 is equal to 25 or is less than 25. F:\xampp\htdocs\bigcms\tests\Feature\FrontendContentSeoTest.php:325 phpvfscomposer://F:\xampp\htdocs\bigcms\vendor\phpunit\phpunit\phpunit:106 22) Tests\Feature\FrontendContentSortingTest::test_sorted_list_does_not_cause_n_plus_one Failed asserting that 27 is equal to 25 or is less than 25. F:\xampp\htdocs\bigcms\tests\Feature\FrontendContentSortingTest.php:259 phpvfscomposer://F:\xampp\htdocs\bigcms\vendor\phpunit\phpunit\phpunit:106 23) Tests\Feature\FrontendContentTest::test_book_content_type_is_not_public Expected response status code [404] but received 302. Failed asserting that 404 is identical to 302. F:\xampp\htdocs\bigcms\vendor\laravel\framework\src\Illuminate\Testing\TestResponse.php:177 F:\xampp\htdocs\bigcms\vendor\laravel\framework\src\Illuminate\Testing\TestResponse.php:134 F:\xampp\htdocs\bigcms\tests\Feature\FrontendContentTest.php:111 phpvfscomposer://F:\xampp\htdocs\bigcms\vendor\phpunit\phpunit\phpunit:106 24) Tests\Feature\FrontendContentTest::test_public_show_does_not_cause_n_plus_one Failed asserting that 27 is equal to 25 or is less than 25. F:\xampp\htdocs\bigcms\tests\Feature\FrontendContentTest.php:213 phpvfscomposer://F:\xampp\htdocs\bigcms\vendor\phpunit\phpunit\phpunit:106 25) Tests\Feature\GlobalSearchTest::test_search_page_renders_chips_and_preserves_type_filter Failed asserting that '\r\n \r\n \r\n \r\n \r\n جستجو | پايگاه علمي المنجي\r\n \r\n \r\n \r\n \r\n \r\n \r\n \r\n \r\n \r\n \r\n \r\n \r\n \r\n \r\n \r\n \r\n \r\n \r\n \r\n
\r\n \r\n \r\n
\r\n \r\n
\r\n \r\n
\r\n
\n \r\n \n
\n

جستجو

\n

\n نتایج برای «RenderChipTerm»\n 1 مورد پیدا شد\n

\n
\n \n \n \n
\n
\n \n \n
\n
\n \n \n \n \n \n \n \n \n \n \n \n \n \n \n \n \n \n \n \n \n \n \n \n \n \n
\n \n
\n \n \n \n
\n

جستجو

\n \n \n \n
\n
\n
\r\n
\r\n \r\n \r\n \r\n \r\n \r\n \r\n \r\n ' contains "site-search-chips__chip". F:\xampp\htdocs\bigcms\tests\Feature\GlobalSearchTest.php:1847 phpvfscomposer://F:\xampp\htdocs\bigcms\vendor\phpunit\phpunit\phpunit:106 26) Tests\Feature\GlobalSearchTest::test_search_page_renders_exact_phrase_chip_for_multiword Failed asserting that '\r\n \r\n \r\n \r\n \r\n جستجو | پايگاه علمي المنجي\r\n \r\n \r\n \r\n \r\n \r\n \r\n \r\n \r\n \r\n \r\n \r\n \r\n \r\n \r\n \r\n \r\n \r\n \r\n \r\n
\r\n \r\n \r\n
\r\n \r\n
\r\n \r\n
\r\n
\n \r\n \n
\n

جستجو

\n

\n نتایج برای «ExactChipOne ExactChipTwo»\n 1 مورد پیدا شد\n

\n
\n \n \n \n
\n
\n \n \n
\n
\n \n \n \n \n \n \n \n \n \n \n \n \n \n \n \n \n \n \n \n \n \n \n \n \n \n
\n \n
\n \n \n
\n

واژه‌های جستجو

\n
    \n
  • \n \n ExactChipOne\n 1 مورد\n \n
  • \n
  • \n \n ExactChipTwo\n 1 مورد\n \n
  • \n
\n
\n \n
\n

جستجو

\n \n \n \n
\n
\n
\r\n
\r\n \r\n \r\n \r\n \r\n \r\n \r\n \r\n ' contains "site-search-chips__chip--phrase". F:\xampp\htdocs\bigcms\tests\Feature\GlobalSearchTest.php:1860 phpvfscomposer://F:\xampp\htdocs\bigcms\vendor\phpunit\phpunit\phpunit:106 27) Tests\Feature\HomepageFrontendTest::test_widgets_respect_locale_and_skip_inactive_and_book_types Failed asserting that '\r\n \r\n \r\n \r\n \r\n پايگاه علمي المنجي\r\n \r\n \r\n \r\n \r\n \r\n \r\n \r\n \r\n \r\n \r\n \r\n \r\n \r\n \r\n \r\n \r\n \r\n

locale: fa

\r\n \r\n \r\n
\r\n \n \r\n
\r\n \r\n
\r\n \r\n
\r\n
\r\n
\r\n
\r\n
\r\n
\r\n
\r\n
\r\n \r\n
\r\n
\r\n

\r\n \r\n آخرین مطالب\r\n

\r\n
\r\n \r\n
\r\n \r\n
\r\n \r\n

ربیع‌الثانی

\r\n \r\n همه مناسبت‌ها\r\n \r\n \r\n
\r\n \r\n
\r\n

برای این ماه مناسبتی در این زبان ثبت نشده است.

\r\n
\r\n \r\n \r\n \r\n \r\n
\r\n \r\n

صفحه کتاب

\r\n \r\n بیشتر\r\n \r\n \r\n
\r\n \r\n \r\n \r\n \r\n \r\n \r\n
\r\n \r\n

اخبار سایت

\r\n \r\n بیشتر\r\n \r\n \r\n
\r\n \r\n \r\n \r\n \r\n \r\n
\r\n
\r\n
\r\n
\r\n
\r\n \r\n \r\n \r\n \r\n \r\n \r\n \r\n ' does not contain "Book Should Not Show". F:\xampp\htdocs\bigcms\vendor\laravel\framework\src\Illuminate\Testing\TestResponse.php:655 F:\xampp\htdocs\bigcms\tests\Feature\HomepageFrontendTest.php:236 phpvfscomposer://F:\xampp\htdocs\bigcms\vendor\phpunit\phpunit\phpunit:106 28) Tests\Feature\MagazineListingThemeTest::test_magazine_keeps_search_sort_and_pagination Failed asserting that '\r\n \r\n \r\n \r\n \r\n مقالات | پايگاه علمي المنجي\r\n \r\n \r\n \r\n \r\n \r\n \r\n \r\n \r\n \r\n \r\n \r\n \r\n \r\n \r\n \r\n \r\n \r\n \r\n \r\n \r\n
\r\n \r\n \r\n
\r\n \r\n
\r\n \r\n
\r\n
\r\n \r\n \r\n
\r\n

مقالات

\r\n

\r\n \r\n 0\r\n بازدید\r\n

\r\n
\r\n \r\n \r\n \r\n

\r\n نتایج برای «unique-magazine-keyword»\r\n

\r\n \r\n
\r\n

\r\n نتیجه‌ای برای «unique-magazine-keyword» پیدا نشد.\r\n

\r\n
\r\n
\r\n
\r\n
\r\n \r\n \r\n \r\n \r\n \r\n \r\n \r\n ' contains "Findable Magazine". F:\xampp\htdocs\bigcms\vendor\laravel\framework\src\Illuminate\Testing\TestResponse.php:581 F:\xampp\htdocs\bigcms\tests\Feature\MagazineListingThemeTest.php:148 phpvfscomposer://F:\xampp\htdocs\bigcms\vendor\phpunit\phpunit\phpunit:106 29) Tests\Feature\TaxonomyFieldIntegrationTest::test_inactive_term_rejected_for_new_but_kept_on_update Failed asserting that two strings are equal. --- Expected +++ Actual @@ @@ -'http://localhost/admin/contents/1' +'http://localhost/admin/contents/1/edit' F:\xampp\htdocs\bigcms\vendor\laravel\framework\src\Illuminate\Testing\TestResponse.php:388 F:\xampp\htdocs\bigcms\vendor\laravel\framework\src\Illuminate\Testing\TestResponse.php:275 F:\xampp\htdocs\bigcms\tests\Feature\TaxonomyFieldIntegrationTest.php:302 phpvfscomposer://F:\xampp\htdocs\bigcms\vendor\phpunit\phpunit\phpunit:106 ERRORS! Tests: 1357, Assertions: 7668, Errors: 1, Failures: 29, Skipped: 2.